Linear Collider Forum



Home » Software Tools » org.lcsim » errors during JAS install
errors during JAS install [message #1519] Tue, 24 June 2008 07:48 Go to previous message
manly
Messages: 21
Registered: May 2008
Location: University of Rochester
I have a summer student named Sven Hauksson trying to get lcsim software/JAS3 up and running on a MACBook. The problems/status/error messages we are encountering are summarized below. Any help is appreciated. -Steve

Have successfully downloaded GeomConverter and lcsim to the MACBook. Both build with maven, though lcsim requires that we build using "maven -Dmaven.test.skip=true" because of some errors that come up during testing. (I had the same problem on a Windows XP machine earlier in the week.)

Anyway, when installing JAS3 with
maven, from the directory he has lcsim in, using the command:

/users/sven/De*/maven-1.0.2/bin/maven jas:install

he get the errors:

TEST org.lcsim.StdhepFilterTest FAILED
Running org.lcsim.TestFastMC
Tests run: 1, Failures: 0, Errors: 1, Time elapsed: 73.973 sec
TEST org.lcsim.TestFastMC FAILED
Running org.lcsim.TestFastMCGenerator
Tests run: 1, Failures: 0, Errors: 1, Time elapsed: 67.502 sec
TEST org.lcsim.TestFastMCGenerator FAILED
[junit] Running org.lcsim.util.aida.AIDATest

BUILD FAILED


However JAS3 will successfully build (supposedly) if he uses the command:

/users/sven/De*/maven-1.0.2/bin/maven jas:install -Dmaven.test.skip=true

After all this trivialPFA compiles but will not run. He can run all the java examples,
but all of the org.lcsim examples return the same error as TrivialPFA.

He says:

The error when I try to run TrvialPFA or any of the org.lcsim is: "Error
running (name of file)".

ex. for Trvial PFA I get:

"Error running
TrivialPFA". Then when I click on details I get a long list of problems,
which I don't know how to shorten.


For example for Trivial PFA I get:

java.lang.NoSuchMethodException: Analysis101.main([Ljava.lang.String;)
at java.lang.Class.getMethod(Class.java:1581)
at
org.freehep.jas.extension.compiler.JASClassManager.run(JASCl assManager.java:223)
at
org.freehep.jas.extension.compiler.CompilerPlugin.run(Compil erPlugin.java:136)
at
org.freehep.jas.extension.compiler.CompilerPlugin.access$200 (CompilerPlugin.java:45)
at
org.freehep.jas.extension.compiler.CompilerPlugin$Commands.o nRun(CompilerPlugin.java:477)
at sun.reflect.NativeMethodAccessorImpl.invoke0(Native Method)
at
sun.reflect.NativeMethodAccessorImpl.invoke(NativeMethodAcce ssorImpl.java:39)
at
sun.reflect.DelegatingMethodAccessorImpl.invoke(DelegatingMe thodAccessorImpl.java:25)
at java.lang.reflect.Method.invoke(Method.java:585)
at
org.freehep.util.commanddispatcher.CommandProcessor.invoke(C ommandProcessor.java:125)
at
org.freehep.util.commanddispatcher.CommandProcessor.invokeCo mmand(CommandProcessor.java:162)
at
org.freehep.util.commanddispatcher.CommandProcessor$SimpleTa rget.doCommand(CommandProcessor.java:290)
at
org.freehep.util.commanddispatcher.CommandProcessor.invokeCo mmand(CommandProcessor.java:136)
at
org.freehep.util.commanddispatcher.CommandProcessor$SimpleTa rget.invoke(CommandProcessor.java:326)
at
org.freehep.util.commanddispatcher.MultiTarget.invoke(MultiT arget.java:72)
at
org.freehep.util.commanddispatcher.CommandSourceAdapter.acti onPerformed(CommandSourceAdapter.java:89)
at
javax.swing.AbstractButton.fireActionPerformed(AbstractButto n.java:1882)
at
javax.swing.AbstractButton$Handler.actionPerformed(AbstractB utton.java:2202)
at
javax.swing.DefaultButtonModel.fireActionPerformed(DefaultBu ttonModel.java:420)
at javax.swing.DefaultButtonModel.setPressed(DefaultButtonModel .java:258)
at javax.swing.AbstractButton.doClick(AbstractButton.java:334)
at apple.laf.ScreenMenuItem.actionPerformed(ScreenMenuItem.java :104)
at java.awt.MenuItem.processActionEvent(MenuItem.java:597)
at java.awt.MenuItem.processEvent(MenuItem.java:556)
at java.awt.MenuComponent.dispatchEventImpl(MenuComponent.java: 298)
at java.awt.MenuComponent.dispatchEvent(MenuComponent.java:286)
at java.awt.EventQueue.dispatchEvent(EventQueue.java:466)
at
org.freehep.jas.util.waitcursor.WaitCursorEventQueue.dispatc hEvent(WaitCursorEventQueue.java:47)
at
java.awt.EventDispatchThread.pumpOneEventForHierarchy(EventD ispatchThread.java:269)
at
java.awt.EventDispatchThread.pumpEventsForHierarchy(EventDis patchThread.java:190)
at java.awt.EventDispatchThread.pumpEvents(EventDispatchThread. java:184)
at java.awt.EventDispatchThread.pumpEvents(EventDispatchThread. java:176)
at java.awt.EventDispatchThread.run(EventDispatchThread.java:11 0)


I'll follow up later with the error he gets trying to run these routines ... I don't have it with me at the moment. In th
 
Read Message
Read Message
Read Message
Read Message
Read Message
Read Message
Read Message
Read Message
Read Message
Read Message
Read Message
Read Message
Read Message
Read Message
Previous Topic:java.lang.OutOfMemoryError:
Next Topic:Proxy settings
Goto Forum:
  


Current Time: Mon Apr 23 23:50:51 Pacific Daylight Time 2018
.:: Contact :: Home ::.

Powered by: FUDforum 3.0.1.
Copyright ©2001-2010 FUDforum Bulletin Board Software