Linear Collider Forum

Home » Analysis and Reconstruction » Tracking & Vertexing » Problem on new trunk version r2253
Problem on new trunk version r2253 [message #2070] Wed, 08 September 2010 09:28 Go to previous message
Messages: 4
Registered: May 2008
Martin updated the MarlinTPC trunk, r2253.
I got and build them, but the building error has been
happened. The error message are in below,

/afs/ / error: prototype for `std::string marlintpc::TrackFitterKalman::getRevision()' does not match any in class `marlintpc::TrackFitterKalman'
/afs/ lude/TrackFitterKalman.h:58: error: candidate is: virtual std::string marlintpc::TrackFitterKalman::getRevision() const
/afs/ / error: prototype for `IMPL::TrackImpl* marlintpc::TrackFitterKalman::fitTrack(const EVENT::Track*)' does not match any in class `marlintpc::TrackFitterKalman'
/afs/ lude/TrackFitterKalman.h:94: error: candidate is: virtual IMPL::TrackImpl* marlintpc::TrackFitterKalman::fitTrack(const EVENT::Track*) const
make[2]: *** [reconstruction/CMakeFiles/lib_MarlinTPCReconstruction.dir/s rc/TrackFitterKalman.o] Error 1
make[1]: *** [reconstruction/CMakeFiles/lib_MarlinTPCReconstruction.dir/a ll] Error 2
make: *** [all] Error 2

I think Martin checked r2253 without Kalman filter. Because
TrackFitterKalman requires to have KalTest and KalDet.
I need help to solve the above problem. Could someone help me?

Yukihiro Kato

Read Message
Read Message
Read Message
Read Message yes.gif
Previous Topic:LCTPC Conditions Database
Next Topic:building LCFIVertex with AIDAJNI
Goto Forum:

Current Time: Mon Mar 19 11:17:36 Pacific Daylight Time 2018
.:: Contact :: Home ::.

Powered by: FUDforum 3.0.1.
Copyright ©2001-2010 FUDforum Bulletin Board Software