Linear Collider Forum

Home » Software Tools » org.lcsim » GemConverter build Failed
GemConverter build Failed [message #2126] Tue, 18 January 2011 02:52 Go to previous message
Messages: 7
Registered: July 2010
Hi all,
I am working on UBUNTU (version 10.04) & have installed the following version of JAVA & maven:
Apache Maven 3.0.2
Java version: 1.6.0_20

I have build several projects(like lcsim, lcsim-cotrib, lcsim parent) using mvn (mvn -DskipTests=true clean install) but while building GeomConverter project, build failed error message is coming. Please find here the full error message:

Error Message:
************************************************************ ******************
[INFO] Building GeomConverter
[INFO] task-segment: [clean, install]
[INFO] ------------------------------------------------------------ ------------
[INFO] [clean:clean {execution: default-clean}]
[INFO] [resources:resources {execution: default-resources}]
[WARNING] Using platform encoding (UTF-8 actually) to copy filtered resources, i.e. build is platform dependent!
[INFO] Copying 21 resources
[INFO] [compiler:compile {execution: default-compile}]
[INFO] Compiling 359 source files to /home/poojasaxena/CLIC/GeomConverter/target/classes
[INFO] [antrun:run {execution: default}]
[INFO] Executing tasks
[mkdir] Created dir: /home/poojasaxena/CLIC/GeomConverter/target/test-output
[INFO] Executed tasks
[INFO] [resources:testResources {execution: default-testResources}]
[WARNING] Using platform encoding (UTF-8 actually) to copy filtered resources, i.e. build is platform dependent!
[INFO] Copying 38 resources
[INFO] [compiler:testCompile {execution: default-testCompile}]
[INFO] Compiling 75 source files to /home/poojasaxena/CLIC/GeomConverter/target/test-classes
[INFO] [surefire:test {execution: default-test}]
[INFO] Tests are skipped.
[INFO] [jar:jar {execution: default-jar}]
[INFO] Building jar: /home/poojasaxena/CLIC/GeomConverter/target/GeomConverter-1. 11-SNAPSHOT.jar
[INFO] [assembly:attached {execution: default}]
[INFO] Reading assembly descriptor: /home/poojasaxena/CLIC/GeomConverter/src/assembly/bin.xml
[INFO] ------------------------------------------------------------ ------------
[INFO] ------------------------------------------------------------ ------------
[ERROR] Failed to execute goal org.apache.maven.plugins:maven-assembly-plugin:2.2-beta-5:at tached (default) on project GeomConverter: Failed to create assembly: Error adding file-set for 'hep.testdata.aida:lizard:aida:1.0' to archive: Error adding archived file-set. PlexusIoResourceCollection not found for: /home/poojasaxena/.m2/repository/hep/testdata/aida/lizard/1. 0/lizard-1.0.aida: No such archiver: 'aida'. -> [Help 1]
[ERROR] To see the full stack trace of the errors, re-run Maven with the -e switch.
[ERROR] Re-run Maven using the -X switch to enable full debug logging.
[ERROR] For more information about the errors and possible solutions, please read the following articles:
[ERROR] [Help 1] onException
************************************************************ *****

please reply.
Thanks in advance
Read Message
Read Message icon12.gif
Previous Topic:JAS3: No information about the Detector Geometry Error
Next Topic:GeomConverter, 'conditions set not found: SamplingFractions/EcalEndcap'
Goto Forum:

Current Time: Wed Dec 11 11:25:29 Pacific Standard Time 2019
.:: Contact :: Home ::.

Powered by: FUDforum 3.0.1.
Copyright ©2001-2010 FUDforum Bulletin Board Software